Failed to resolve module specifier process

And if the replies as above are helpful, we would appreciate you to mark them as answers, and if you resolve it using your own solution, please share your experience and solution here. It will be greatly helpful to others who have the same question. Appreciate for your feedback. Best Regards, Albert Ling.
flipper zero credit cardbest Gaming forum.

baby boutique palm springs

free xxx interracial videos

how does using mynav allow accenture to help its clients become more sustainable

famed italian violin makers. Jul 30, 2021 · Subscribe or Follow Me For Updates. Subscribe to my YouTube channel or follow me on Twitter, Facebook or GitHub to be notified when I post new content..The App component shows a list of items (hits = Hacker News articles). The state and state update function come from the state hook called useState that is responsible to manage.

teen virgin first time sex video

If that doesn't work, we need to perform a System File Check and then run the Deployment Image Servicing and Management tool (DISM). Right click the Windows Start button and select Command Prompt (Admin). Type 'sfc /scannow' and hit Enter. Allow the process to complete. Type 'DISM /Online /Cleanup-Image /RestoreHealth' and hit Enter.

awaiting editor review tvt

I get electron -quick-start and electron -polymer from fluidnext to use for my Polymer 3 application. When i try to import my webcomponents to the project, i have got this error: Uncaught TypeError: Failed to resolve module specifier.

nsfw ascii art

outer banks vacation packages; 2019 polaris ranger 1000 wont turn over; draw the shear diagram for the compound beam which is pin connected at b;.

baptist denominations beliefs

The main problem comes from not being able to resolve file locations of "from" statements. All begins with the main import command, after running npm install @js-temporal/polyfill. Uncaught TypeError: Failed to resolve module specifier "big-integer". Relative references must start with either "/", "./", or "../".

patch0 xml download file

Then go to the Transaction "SE37" and enter the function module (ZAU_CONCUR_IDOC_UPLD) put a break point in the function module as shown in the below. Step 4: 1.Go the Transaction "BD20", enter the newly generated IDOC and execute. 2. After click on execute button, it will trigger into the function module as shown in the below.

all world cards leak download

Search for jobs related to Electron failed to resolve module specifier or hire on the world's largest freelancing marketplace with 21m+ jobs. It's free to sign up and bid on jobs.

mitese procedure for lymphedema

If you want to use Module Specifiers, you need a tool to resolve those. An example of such tool is WebPack. It will resolve all these import statement for you and generate one javascript file instead that you can add to your html file instead. Also Check that do you have any default exports in your node-pandas or not.

pyt pretty young thing remix

Failed to resolve module specifier "process". Relative references must start with either "/", "./", or "../".

famous big breasts

Issue the dir dfc# module #-bootflash: command in order to verify if there is a crash information file and when it was written. If the DFC reset matches the crashinfo timestamp, issue the more dfc# module #-bootflash: filename command. Or, issue the copy dfc# module #-bootflash: filename tftp command in order to transfer the file via TFTP to a.

women of the 70s

Failed to load module script: The server responded with a non-JavaScript MIME type of "text/html". Strict MIME type checking is enforced for module scripts per HTML spec. Here is my index.html:. As Nact is a commonjs module, you'll need a bundler like Parcel or Webpack to be able to convert the library into the appropriate module format. Share.

halifax clarity exchange rate euro today

When i try to import my webcomponents to the project, i have got this error: Uncaught TypeError: Failed to resolve module specifier "@polymer/polymer/polymer. Jun 07, 2022 · Common root issues and resolutions include: Scaling with insufficient compute (CRP) quota. To resolve, first scale your cluster back to a stable goal state within quota.

45 degree bracket for 2x4

Mar 04, 2022 · Use the dependency out of process. This solution is more for module users than module authors. This is a solution to use when confronted with a module that won't work due to an existing dependency conflict. Dependency conflicts occur because two versions of the same assembly are loaded into the same .NET process..I'm getting a "Failed to connect to an IPC.

sublimation jersey blanks

To include the partition columns in the DynamicFrame, create a DataFrame first, and then add a column for the Amazon S3 file path. Then, create the DynamicFrame and apply a map transformation to add the partition columns, as shown in the following example. Nov 22, 2021 · Uncaught TypeError: Failed to resolve module specifier "axios".

bmw gs sat nav mount

Select System Data Source and select Next. 5. Select SQL Server and click Next and then Finish. 6. Type the name for the ODBC connection and the name of the SQL server in the appropriate text boxes. 7. Click Next and then select the With SQL server authentication using a login id and password entered by the user checkbox. 8. Click Next and.

vroid bear

famed italian violin makers. Jul 30, 2021 · Subscribe or Follow Me For Updates. Subscribe to my YouTube channel or follow me on Twitter, Facebook or GitHub to be notified when I post new content..The App component shows a list of items (hits = Hacker News articles). The state and state update function come from the state hook called useState that is responsible to manage.

altium off sheet connector vs port

How to identify and resolve a dependency conflict. ¶. Occasionally when running a deployment on the Cloud or building a project locally, the process will fail, with a message like: ERROR: Service 'web' failed to build: The command '/bin/sh -c pip-reqs compile && pip-reqs resolve && pip install --no-index --no-deps --requirement requirements.

spotify wrapped campaign target audience

This module can be used to collect Windows Event Log messages on Microsoft Windows platforms which support the newer Event Log API (also known as the Crimson Event Log subsystem), namely Windows 2008/Vista and later. See the official Microsoft documentation about Event Logs . The module supports reading all System, Application, and Custom events.

west virginia state police trooper wiseman

!MESSAGE Module named 'MyAPP' failed to deploy.!SUBENTRY 1 com.bea.wlw.server.core 4 4000 2008-10-09 15:24:00.390!MESSAGE weblogic.application.ModuleException: Failed to load webapp: 'MyAPPWEB'!STACK 0 java.lang.Exception: Exception received from deployment driver. In the API Gateway console, choose your API.

convergence and divergence of sequence and series

Then go to the Transaction "SE37" and enter the function module (ZAU_CONCUR_IDOC_UPLD) put a break point in the function module as shown in the below. Step 4: 1.Go the Transaction "BD20", enter the newly generated IDOC and execute. 2. After click on execute button, it will trigger into the function module as shown in the below.

dhiraagu my account

If that doesn't work, we need to perform a System File Check and then run the Deployment Image Servicing and Management tool (DISM). Right click the Windows Start button and select Command Prompt (Admin). Type 'sfc /scannow' and hit Enter. Allow the process to complete. Type 'DISM /Online /Cleanup-Image /RestoreHealth' and hit Enter.

hardcore hermaphrodite porn

In this example, the 'lodash' module specifier is known to the Node.js process because it has access to filesystem or the packages distributed through npm package manager. But the browser can only accept URLs for the module specifier because the only mechanism for getting modules is to download them over the network. macrame butterfly wall hanging.

perfect formula for love ep 1 eng sub myasiantv

The specified module could not be found. Error: Failed to Load DLL: pmsapbwc.dll for Plug-in: PC_SAPBW, vendor Informatica. The specified module could not be found. Error: Failed to Load DLL: pmsapisuplg.dll for Plug-in: PC_SAPISU, Vendor: Informatica. This specified module could not be found. Im trying to use Toastify-js, a library for toast type messages, installing it using.

melissa and joey complete series

Failed to resolve module specifier "process". Relative references must start with either "/", "./", or "../".

clean my cum filled pussy

.

radiator hose sealant

!MESSAGE Module named 'MyAPP' failed to deploy.!SUBENTRY 1 com.bea.wlw.server.core 4 4000 2008-10-09 15:24:00.390!MESSAGE weblogic.application.ModuleException: Failed to load webapp: 'MyAPPWEB'!STACK 0 java.lang.Exception: Exception received from deployment driver. In the API Gateway console, choose your API.

tamed love chapter 1

Aug 06, 2018 · Now is the time to deal with your 'The specified module could not be found' problem: Enter your Registry Editor tool. Go to HKEY_LOCAL_MACHINE > Software > Microsoft > Windows > CurrentVersion. Double-click on it. Then delete Run. Navigate to HKEY_CURRENT_USER > Software > Microsoft > Windows > CurrentVersion.. 15h ago.

zettelkasten notes

Mar 04, 2022 · Use the dependency out of process. This solution is more for module users than module authors. This is a solution to use when confronted with a module that won't work due to an existing dependency conflict. Dependency conflicts occur because two versions of the same assembly are loaded into the same .NET process..I'm getting a "Failed to connect to an IPC.

free milf handjob movies

Search for jobs related to Electron failed to resolve module specifier or hire on the world's largest freelancing marketplace with 21m+ jobs. It's free to sign up and bid on jobs.

convert dicom to grayscale python

AttributeError: module 'tensorflow' has no attribute 'to_int32' site:stackoverflow.com; ignoring warnings; pytest run only failed test; No module named PyInstaller; ValueError: columns overlap but no suffix specified: TypeError: 'float' object is not callable; no 'access-control-allow-origin' header is present on the requested resource.

buy ozempic in canada

To include the partition columns in the DynamicFrame, create a DataFrame first, and then add a column for the Amazon S3 file path. Then, create the DynamicFrame and apply a map transformation to add the partition columns, as shown in the following example. Nov 22, 2021 · Uncaught TypeError: Failed to resolve module specifier "axios".

rocksy light cosplay

Mar 04, 2022 · Use the dependency out of process. This solution is more for module users than module authors. This is a solution to use when confronted with a module that won't work due to an existing dependency conflict. Dependency conflicts occur because two versions of the same assembly are loaded into the same .NET process..I'm getting a "Failed to connect to an IPC.

christian camp for young adults

Then go to the Transaction "SE37" and enter the function module (ZAU_CONCUR_IDOC_UPLD) put a break point in the function module as shown in the below. Step 4: 1.Go the Transaction "BD20", enter the newly generated IDOC and execute. 2. After click on execute button, it will trigger into the function module as shown in the below.

filetype xls username password email

!MESSAGE Module named 'MyAPP' failed to deploy.!SUBENTRY 1 com.bea.wlw.server.core 4 4000 2008-10-09 15:24:00.390!MESSAGE weblogic.application.ModuleException: Failed to load webapp: 'MyAPPWEB'!STACK 0 java.lang.Exception: Exception received from deployment driver. In the API Gateway console, choose your API.

florida sbr legal

This module can be used as an alternative to the following functions or modules in. Failed to resolve module specifier "process". Relative references must start with either "/", "./", or "../". ... The value of the HelpInfoUri key in the module manifest must resolve to a container or root URL on a website where the help files are stored.. LKML.

epic erroneous encounter

This module can be used as an alternative to the following functions or modules in. Failed to resolve module specifier "process". Relative references must start with either "/", "./", or "../". ... The value of the HelpInfoUri key in the module manifest must resolve to a container or root URL on a website where the help files are stored.. LKML.

rust fertilizer to scrap

Mar 04, 2022 · Use the dependency out of process. This solution is more for module users than module authors. This is a solution to use when confronted with a module that won't work due to an existing dependency conflict. Dependency conflicts occur because two versions of the same assembly are loaded into the same .NET process..I'm getting a "Failed to connect to an IPC.

netapp inode increase command

VueJs - Failed to resolve module specifier axios. In Programming Tags # axios #vuejs #javascript Published 11/22/2021. . Sep 15, 2021 · To solve this, the SDK version can be specified in global.json and checked into source control as a common file which would be the same for all developers and ensure that the same SDK version is being used in.

black adam movie download mp4

model builder free download

  1. ropemaker place liverpool is the ultimate destination for playing, discussing, and creating games.
  2. 2k22 unblocked is a to discuss the latest happenings in the gaming sector.
  3. thia azman video dates back to 2007 with original members and founder Diddums joining up people from the UK and North America in the CoD Modern Warfare 2 era. In 2013 our home was born and now has FGers all over the globe that come here to play, chat and have fun with all gaming lovers.
  4. jayden cole sex scene Claymore Gaming is a gaming forum dedicated to discussing various games like Fallout Incursion etc.
  5. bluetti 2000w is your go-to place when looking to chatter about a game of your interest. Read and write posts, comments, reviews, analysis and be a part of GreenMan Gaming community.
  6. excel vba vlookup multiple criteria is a great place to freely and openly share feedback on your Miniclip experience, challenge other players, arrange tournaments & ask questions about all Miniclip games and services.
  7. bella poarch discord reddit is a place to get news, updates and information on popular games like elden ring, super smash and fire emblem heroes.

tranquilizer dart in her buttocks

db2 sql calculate age from birthdate

VueJs - Failed to resolve module specifier axios. In Programming Tags # axios #vuejs #javascript Published 11/22/2021. . Sep 15, 2021 · To solve this, the SDK version can be specified in global.json and checked into source control as a common file which would be the same for all developers and ensure that the same SDK version is being used in. If you want to use Module Specifiers, you need a tool to resolve those. An example of such tool is WebPack. It will resolve all these import statement for you and generate one javascript file instead that you can add to your html file instead. Also Check that do you have any default exports in your node-pandas or not. Uncaught TypeError: Failed to resolve module specifier "axios". Most examples built for the CLI will show an import to axios at the top of the file something like this: import axios from 'axios';. This module can be used as an alternative to the following functions or modules in. Failed to resolve module specifier "process". Relative references must start with either "/", "./", or "../". ... The value of the HelpInfoUri key in the module manifest must resolve to a container or root URL on a website where the help files are stored.. LKML. (6)es-module-shims.jsについてはこちら (7)postprocessingの使い方を参考にやっていたら新たなエラーが発生. ここに書かれているファイルが足. (6)es-module-shims.jsについてはこちら (7)postprocessingの使い方を参考にやっていたら新たなエラーが発生. ここに書かれているファイルが足. Then go to the Transaction "SE37" and enter the function module (ZAU_CONCUR_IDOC_UPLD) put a break point in the function module as shown in the below. Step 4: 1.Go the Transaction "BD20", enter the newly generated IDOC and execute. 2. After click on execute button, it will trigger into the function module as shown in the below.

toptoon app download


vk itunes m4a

batik textile is famous in the countries below except

onlyfans name generator

So, in order to fix the issue, you can open an elevated command prompt (Run as Administrator) and execute the below command, after of course you replace " number " with the version of SQL Server in terms of number. mofcomp "%programfiles (x86)%\Microsoft SQL Server\number\Shared\sqlmgmproviderxpsp2up.mof". In order to find the right version.

m4a asmr

For the EB1 category, the current estimate is 2–3 years to get a green card. This number will vary by your country of birth - all EB1 categories are currently backlogged, but China’s priority date is further behind the rest of the world. It’s safe to say. Website Hosting. MySite provides free hosting and affordable premium web hosting services to over 100,000 satisfied customers. MySite offers solutions for every kind of hosting need: from personal web hosting, blog hosting or photo hosting, to domain name registration and cheap hosting for small business.. "/>. How to identify and resolve a dependency conflict. ¶. Occasionally when running a deployment on the Cloud or building a project locally, the process will fail, with a message like: ERROR: Service 'web' failed to build: The command '/bin/sh -c pip-reqs compile && pip-reqs resolve && pip install --no-index --no-deps --requirement requirements.

shoei mg42

Uncaught TypeError: Failed to resolve module specifier "axios". Most examples built for the CLI will show an import to axios at the top of the file something like this: import axios from 'axios';. Website Hosting. MySite provides free hosting and affordable premium web hosting services to over 100,000 satisfied customers. MySite offers solutions for every kind of hosting need: from personal web hosting, blog hosting or photo hosting, to domain name registration and cheap hosting for small business.. "/>. Aug 06, 2018 · Now is the time to deal with your 'The specified module could not be found' problem: Enter your Registry Editor tool. Go to HKEY_LOCAL_MACHINE > Software > Microsoft > Windows > CurrentVersion. Double-click on it. Then delete Run. Navigate to HKEY_CURRENT_USER > Software > Microsoft > Windows > CurrentVersion. Search for jobs related to Electron failed to resolve module specifier or hire on the world's largest freelancing marketplace with 21m+ jobs. It's free to sign up and bid on jobs.

ecoflow delta max

When i try to import my webcomponents to the project, i have got this error: Uncaught TypeError: Failed to resolve module specifier "@polymer/polymer/polymer. Jun 07, 2022 · Common root issues and resolutions include: Scaling with insufficient compute (CRP) quota. To resolve, first scale your cluster back to a stable goal state within quota. Issue the dir dfc# module #-bootflash: command in order to verify if there is a crash information file and when it was written. If the DFC reset matches the crashinfo timestamp, issue the more dfc# module #-bootflash: filename command. Or, issue the copy dfc# module #-bootflash: filename tftp command in order to transfer the file via TFTP to a. Failed to resolve module specifier process You can add a data source by either selecting a gateway and click Add data source, or go to Gateway > Add data source. You can then select the Data Source Type from the list. Please select Sharepoint List (on-premises) instead of oracle. View solution in original post. Please follow the steps given below to perform Windows Update Troubleshooter. a) Press Windows Key + W key together. b) Write Troubleshooting in the search box present on the Top right corner. c) Click on the Troubleshooting option obtained after the search. d) Click on View All option present on the top left corner.


women swallowing horse cum

telugu dubbed movies download

If that doesn't work, we need to perform a System File Check and then run the Deployment Image Servicing and Management tool (DISM). Right click the Windows Start button and select Command Prompt (Admin). Type 'sfc /scannow' and hit Enter. Allow the process to complete. Type 'DISM /Online /Cleanup-Image /RestoreHealth' and hit Enter. The middleware appears to be trying to resolve import specifiers that are already paths, and erroring that it cannot resolve them. It should be ignoring them altogether: Unable to resolve Node module specifier "./index-1.js" due to { Err.

easy dnd encounters

In this example, the 'lodash' module specifier is known to the Node.js process because it has access to filesystem or the packages distributed through npm package manager. But the browser can only accept URLs for the module specifier because the only mechanism for getting modules is to download them over the network. macrame butterfly wall hanging. Aug 06, 2018 · Now is the time to deal with your 'The specified module could not be found' problem: Enter your Registry Editor tool. Go to HKEY_LOCAL_MACHINE > Software > Microsoft > Windows > CurrentVersion. Double-click on it. Then delete Run. Navigate to HKEY_CURRENT_USER > Software > Microsoft > Windows > CurrentVersion.. 15h ago. Would be nice to add a theory of operation, or how/whey this should resolve the problem. Maybe also include the correct process for flashing an ESP32 outside of a development board, the best solution for a development board, and why some boards fail. I believe to flash an ESP32, pin IO0 needs to be LOW (0v) when the chip boots.

nude japanese girl gallerys

If you want to use Module Specifiers, you need a tool to resolve those. An example of such tool is WebPack. It will resolve all these import statement for you and generate one javascript file instead that you can add to your html file instead. Also Check that do you have any default exports in your node-pandas or not. The main problem comes from not being able to resolve file locations of "from" statements. All begins with the main import command, after running npm install @js-temporal/polyfill. Uncaught TypeError: Failed to resolve module specifier "big-integer". Relative references must start with either "/", "./", or "../". Issue the dir dfc# module #-bootflash: command in order to verify if there is a crash information file and when it was written. If the DFC reset matches the crashinfo timestamp, issue the more dfc# module #-bootflash: filename command. Or, issue the copy dfc# module #-bootflash: filename tftp command in order to transfer the file via TFTP to a.

ey conflict of interest answers github

This module can be used to collect Windows Event Log messages on Microsoft Windows platforms which support the newer Event Log API (also known as the Crimson Event Log subsystem), namely Windows 2008/Vista and later. See the official Microsoft documentation about Event Logs . The module supports reading all System, Application, and Custom events. !MESSAGE Module named 'MyAPP' failed to deploy.!SUBENTRY 1 com.bea.wlw.server.core 4 4000 2008-10-09 15:24:00.390!MESSAGE weblogic.application.ModuleException: Failed to load webapp: 'MyAPPWEB'!STACK 0 java.lang.Exception: Exception received from deployment driver. In the API Gateway console, choose your API.


748 tritype description

clash ssr config

Mar 04, 2022 · Use the dependency out of process. This solution is more for module users than module authors. This is a solution to use when confronted with a module that won't work due to an existing dependency conflict. Dependency conflicts occur because two versions of the same assembly are loaded into the same .NET process..I'm getting a "Failed to connect to an IPC. Select System Data Source and select Next. 5. Select SQL Server and click Next and then Finish. 6. Type the name for the ODBC connection and the name of the SQL server in the appropriate text boxes. 7. Click Next and then select the With SQL server authentication using a login id and password entered by the user checkbox. 8. Click Next and. This module can be used to collect Windows Event Log messages on Microsoft Windows platforms which support the newer Event Log API (also known as the Crimson Event Log subsystem), namely Windows 2008/Vista and later. See the official Microsoft documentation about Event Logs . The module supports reading all System, Application, and Custom events.

empower a2 unit 2 progress test

AttributeError: module 'tensorflow' has no attribute 'to_int32' site:stackoverflow.com; ignoring warnings; pytest run only failed test; No module named PyInstaller; ValueError: columns overlap but no suffix specified: TypeError: 'float' object is not callable; no 'access-control-allow-origin' header is present on the requested resource. Aug 06, 2018 · Now is the time to deal with your 'The specified module could not be found' problem: Enter your Registry Editor tool. Go to HKEY_LOCAL_MACHINE > Software > Microsoft > Windows > CurrentVersion. Double-click on it. Then delete Run. Navigate to HKEY_CURRENT_USER > Software > Microsoft > Windows > CurrentVersion. This module can be used as an alternative to the following functions or modules in. Failed to resolve module specifier "process". Relative references must start with either "/", "./", or "../". ... The value of the HelpInfoUri key in the module manifest must resolve to a container or root URL on a website where the help files are stored.. LKML. Mar 04, 2022 · Use the dependency out of process. This solution is more for module users than module authors. This is a solution to use when confronted with a module that won't work due to an existing dependency conflict. Dependency conflicts occur because two versions of the same assembly are loaded into the same .NET process..I'm getting a "Failed to connect to an IPC. But now when I run my application, I get the following: Uncaught TypeError: Failed to resolve module specifier "react".. Remove any temporary items from the metro bundler's cache. These cases might work for you if your problem is related to external dependencies that may have changed (maybe you changed your node_modules without re-running.

i stopped shaving my armpits

Website Hosting. MySite provides free hosting and affordable premium web hosting services to over 100,000 satisfied customers. MySite offers solutions for every kind of hosting need: from personal web hosting, blog hosting or photo hosting, to domain name registration and cheap hosting for small business.. "/>. .

como conectar un android a wifi

If you want to use Module Specifiers, you need a tool to resolve those. An example of such tool is WebPack. It will resolve all these import statement for you and generate one javascript file instead that you can add to your html file instead. Also Check that do you have any default exports in your node-pandas or not. famed italian violin makers. Jul 30, 2021 · Subscribe or Follow Me For Updates. Subscribe to my YouTube channel or follow me on Twitter, Facebook or GitHub to be notified when I post new content..The App component shows a list of items (hits = Hacker News articles). The state and state update function come from the state hook called useState that is responsible to manage. Would be nice to add a theory of operation, or how/whey this should resolve the problem. Maybe also include the correct process for flashing an ESP32 outside of a development board, the best solution for a development board, and why some boards fail. I believe to flash an ESP32, pin IO0 needs to be LOW (0v) when the chip boots. Review installer.log to determine the cause of the installation failure. The collision module is dependent on an AnimWires module above it for wire guided method. Either that AnimWires module is inactive or deactivated from errors, or does not have the "affectCollision" option checked. (Collision) This message, and the following "Dependency.


fe hand script pastebin

unable to set the columnwidth property of the range class

Search for jobs related to Electron failed to resolve module specifier or hire on the world's largest freelancing marketplace with 21m+ jobs. It's free to sign up and bid on jobs. But now when I run my application, I get the following: Uncaught TypeError: Failed to resolve module specifier "react".. Failed to resolve module specifier socket.io-client. Relative references must start with either /, ./, or ../ ... Maybe also include the correct process for flashing an ESP32 outside of a development board, the best solution. The main problem comes from not being able to resolve file locations of "from" statements. All begins with the main import command, after running npm install @js-temporal/polyfill. Uncaught TypeError: Failed to resolve module specifier "big-integer". Relative references must start with either "/", "./", or "../".

mckenzie valdez dropbox

VueJs - Failed to resolve module specifier axios. In Programming Tags # axios #vuejs #javascript Published 11/22/2021. . Sep 15, 2021 · To solve this, the SDK version can be specified in global.json and checked into source control as a common file which would be the same for all developers and ensure that the same SDK version is being used in.

chongyun x xingqiu lemon

For the EB1 category, the current estimate is 2–3 years to get a green card. This number will vary by your country of birth - all EB1 categories are currently backlogged, but China’s priority date is further behind the rest of the world. It’s safe to say.


hcx 9443

wells fargo custom card

Failed to load module script: The server responded with a non-JavaScript MIME type of "text/html". Strict MIME type checking is enforced for module scripts per HTML spec. Here is my index.html:. As Nact is a commonjs module, you'll need a bundler like Parcel or Webpack to be able to convert the library into the appropriate module format. Share.

pitbull attack statistics

In this example, the 'lodash' module specifier is known to the Node.js process because it has access to filesystem or the packages distributed through npm package manager. But the browser can only accept URLs for the module specifier because the only mechanism for getting modules is to download them over the network. macrame butterfly wall hanging. In general, look for scripts which import by module name / specifier like this: import Vue from "vue"; instead of loading by path: import Vue from "./vue.js"; Module specifiers don't contain / and they have no extension. They work in environments like node but not in a browser. See also: module specifier in es6 import and export.

ultra low noise amplifier

This module can be used as an alternative to the following functions or modules in. Failed to resolve module specifier "process". Relative references must start with either "/", "./", or "../". ... The value of the HelpInfoUri key in the module manifest must resolve to a container or root URL on a website where the help files are stored.. LKML. Uncaught TypeError: Failed to resolve module specifier "axios". Most examples built for the CLI will show an import to axios at the top of the file something like this: import axios from 'axios';. AttributeError: module 'tensorflow' has no attribute 'to_int32' site:stackoverflow.com; ignoring warnings; pytest run only failed test; No module named PyInstaller; ValueError: columns overlap but no suffix specified: TypeError: 'float' object is not callable; no 'access-control-allow-origin' header is present on the requested resource. The heart of Mule's batch processing functionality lies within the. Process Chain Started from the yesterday's failed step: In few instances, process chain starts from the step which was failed in the previous iteration instead of starting from the "Start" step. ... It will resolve all these import statement for you and generate one javascript.

41 dodge truck for sale

Please follow the steps given below to perform Windows Update Troubleshooter. a) Press Windows Key + W key together. b) Write Troubleshooting in the search box present on the Top right corner. c) Click on the Troubleshooting option obtained after the search. d) Click on View All option present on the top left corner. Aug 06, 2018 · Now is the time to deal with your 'The specified module could not be found' problem: Enter your Registry Editor tool. Go to HKEY_LOCAL_MACHINE > Software > Microsoft > Windows > CurrentVersion. Double-click on it. Then delete Run. Navigate to HKEY_CURRENT_USER > Software > Microsoft > Windows > CurrentVersion.. 15h ago.


tmnt donnie x reader lemon mating season

como armar un cubo de rubik paso a paso

To include the partition columns in the DynamicFrame, create a DataFrame first, and then add a column for the Amazon S3 file path. Then, create the DynamicFrame and apply a map transformation to add the partition columns, as shown in the following example. Nov 22, 2021 · Uncaught TypeError: Failed to resolve module specifier "axios". Search for jobs related to Electron failed to resolve module specifier or hire on the world's largest freelancing marketplace with 21m+ jobs. It's free to sign up and bid on jobs. But now when I run my application, I get the following: Uncaught TypeError: Failed to resolve module specifier "react".. Failed to resolve module specifier socket.io-client. Relative references must start with either /, ./, or ../ ... Maybe also include the correct process for flashing an ESP32 outside of a development board, the best solution. Search for jobs related to Electron failed to resolve module specifier or hire on the world's largest freelancing marketplace with 21m+ jobs. It's free to sign up and bid on jobs.

gogo live twitter

But now when I run my application, I get the following: Uncaught TypeError: Failed to resolve module specifier "react".. Remove any temporary items from the metro bundler's cache. These cases might work for you if your problem is related to external dependencies that may have changed (maybe you changed your node_modules without re-running. Search for jobs related to Electron failed to resolve module specifier or hire on the world's largest freelancing marketplace with 21m+ jobs. It's free to sign up and bid on jobs. Nov 22, 2021 · Uncaught TypeError: Failed to resolve module specifier "axios". Most examples built for the CLI will show an import to axios at the top of the file something like this: import axios from 'axios';. hud updates. salat maghreb myrtle beach sc pes refinery capacity; ios 16 font emoji download people who dropped out of college.

futbin draft 22

Website Hosting. MySite provides free hosting and affordable premium web hosting services to over 100,000 satisfied customers. MySite offers solutions for every kind of hosting need: from personal web hosting, blog hosting or photo hosting, to domain name registration and cheap hosting for small business.. "/>. I get electron -quick-start and electron -polymer from fluidnext to use for my Polymer 3 application. When i try to import my webcomponents to the project, i have got this error: Uncaught TypeError: Failed to resolve module specifier. VueJs - Failed to resolve module specifier axios. In Programming Tags # axios #vuejs #javascript Published 11/22/2021. . Sep 15, 2021 · To solve this, the SDK version can be specified in global.json and checked into source control as a common file which would be the same for all developers and ensure that the same SDK version is being used in.

erotic wive stories

The specified module could not be found. Error: Failed to Load DLL: pmsapbwc.dll for Plug-in: PC_SAPBW, vendor Informatica. The specified module could not be found. Error: Failed to Load DLL: pmsapisuplg.dll for Plug-in: PC_SAPISU, Vendor: Informatica. This specified module could not be found. Im trying to use Toastify-js, a library for toast type messages, installing it using. .


on your wedding day dramacool

aya awakenings full movie

For the EB1 category, the current estimate is 2–3 years to get a green card. This number will vary by your country of birth - all EB1 categories are currently backlogged, but China’s priority date is further behind the rest of the world. It’s safe to say. So, in order to fix the issue, you can open an elevated command prompt (Run as Administrator) and execute the below command, after of course you replace " number " with the version of SQL Server in terms of number. mofcomp "%programfiles (x86)%\Microsoft SQL Server\number\Shared\sqlmgmproviderxpsp2up.mof". In order to find the right version. Failed to resolve module specifier process You can add a data source by either selecting a gateway and click Add data source, or go to Gateway > Add data source. You can then select the Data Source Type from the list. Please select Sharepoint List (on-premises) instead of oracle. View solution in original post. If that doesn't work, we need to perform a System File Check and then run the Deployment Image Servicing and Management tool (DISM). Right click the Windows Start button and select Command Prompt (Admin). Type 'sfc /scannow' and hit Enter. Allow the process to complete. Type 'DISM /Online /Cleanup-Image /RestoreHealth' and hit Enter.

hp officejet pro 9010 cartridge problem

Also Check that do you have any default exports in your node-pandas or not. Failed to resolve module specifier socket.io-client. Relative references must start with either /, ./, or ../ ... module as declared in the module -info resolve (__dirname, "src", "components") } 然后我们使用 React Native 프로젝트에 ESLint와 Prettier를. Feb 19, 2021 · If you want to use Module Specifiers, you need a tool to resolve those. An example of such tool is WebPack. It will resolve all these import statement for you and generate one javascript file instead that you can add to your html file instead. Also Check that do you have any default exports in your node-pandas or not.. "/>. VueJs - Failed to resolve module specifier axios. In Programming Tags # axios #vuejs #javascript Published 11/22/2021. . Sep 15, 2021 · To solve this, the SDK version can be specified in global.json and checked into source control as a common file which would be the same for all developers and ensure that the same SDK version is being used in. famed italian violin makers. Jul 30, 2021 · Subscribe or Follow Me For Updates. Subscribe to my YouTube channel or follow me on Twitter, Facebook or GitHub to be notified when I post new content..The App component shows a list of items (hits = Hacker News articles). The state and state update function come from the state hook called useState that is responsible to manage. AttributeError: module 'tensorflow' has no attribute 'to_int32' site:stackoverflow.com; ignoring warnings; pytest run only failed test; No module named PyInstaller; ValueError: columns overlap but no suffix specified: TypeError: 'float' object is not callable; no 'access-control-allow-origin' header is present on the requested resource.

hertz false damage claims

Nov 22, 2021 · Uncaught TypeError: Failed to resolve module specifier "axios". Most examples built for the CLI will show an import to axios at the top of the file something like this: import axios from 'axios';. hud updates. salat maghreb myrtle beach sc pes refinery capacity; ios 16 font emoji download people who dropped out of college. For the EB1 category, the current estimate is 2–3 years to get a green card. This number will vary by your country of birth - all EB1 categories are currently backlogged, but China’s priority date is further behind the rest of the world. It’s safe to say. How to identify and resolve a dependency conflict. ¶. Occasionally when running a deployment on the Cloud or building a project locally, the process will fail, with a message like: ERROR: Service 'web' failed to build: The command '/bin/sh -c pip-reqs compile && pip-reqs resolve && pip install --no-index --no-deps --requirement requirements. Website Hosting. MySite provides free hosting and affordable premium web hosting services to over 100,000 satisfied customers. MySite offers solutions for every kind of hosting need: from personal web hosting, blog hosting or photo hosting, to domain name registration and cheap hosting for small business.. "/>.

yamaha r1 immobiliser emulator

Aug 06, 2018 · Now is the time to deal with your 'The specified module could not be found' problem: Enter your Registry Editor tool. Go to HKEY_LOCAL_MACHINE > Software > Microsoft > Windows > CurrentVersion. Double-click on it. Then delete Run. Navigate to HKEY_CURRENT_USER > Software > Microsoft > Windows > CurrentVersion.. 15h ago.


recap meaning in hindi

monster of the week character sheet pdf

The heart of Mule's batch processing functionality lies within the. Process Chain Started from the yesterday's failed step: In few instances, process chain starts from the step which was failed in the previous iteration instead of starting from the "Start" step. ... It will resolve all these import statement for you and generate one javascript. For the EB1 category, the current estimate is 2–3 years to get a green card. This number will vary by your country of birth - all EB1 categories are currently backlogged, but China’s priority date is further behind the rest of the world. It’s safe to say. Uncaught TypeError: Failed to resolve module specifier "axios". Most examples built for the CLI will show an import to axios at the top of the file something like this: import axios from 'axios';. If you want to use Module Specifiers, you need a tool to resolve those. An example of such tool is WebPack. It will resolve all these import statement for you and generate one javascript file instead that you can add to your html file instead. Also Check that do you have any default exports in your node-pandas or not.

apex legends super glide script

!MESSAGE Module named 'MyAPP' failed to deploy.!SUBENTRY 1 com.bea.wlw.server.core 4 4000 2008-10-09 15:24:00.390!MESSAGE weblogic.application.ModuleException: Failed to load webapp: 'MyAPPWEB'!STACK 0 java.lang.Exception: Exception received from deployment driver. In the API Gateway console, choose your API. outer banks vacation packages; 2019 polaris ranger 1000 wont turn over; draw the shear diagram for the compound beam which is pin connected at b;. Also Check that do you have any default exports in your node-pandas or not. Failed to resolve module specifier socket.io-client. Relative references must start with either /, ./, or ../ ... module as declared in the module -info resolve (__dirname, "src", "components") } 然后我们使用 React Native 프로젝트에 ESLint와 Prettier를. .

blackheads on nose youtube 2021

Feb 19, 2021 · If you want to use Module Specifiers, you need a tool to resolve those. An example of such tool is WebPack. It will resolve all these import statement for you and generate one javascript file instead that you can add to your html file instead. Also Check that do you have any default exports in your node-pandas or not.. "/>.

forticlient error 8

!MESSAGE Module named 'MyAPP' failed to deploy.!SUBENTRY 1 com.bea.wlw.server.core 4 4000 2008-10-09 15:24:00.390!MESSAGE weblogic.application.ModuleException: Failed to load webapp: 'MyAPPWEB'!STACK 0 java.lang.Exception: Exception received from deployment driver. In the API Gateway console, choose your API. In this example, the 'lodash' module specifier is known to the Node.js process because it has access to filesystem or the packages distributed through npm package manager. But the browser can only accept URLs for the module specifier because the only mechanism for getting modules is to download them over the network. macrame butterfly wall hanging.


mokra ujna

3 d porn sites

To include the partition columns in the DynamicFrame, create a DataFrame first, and then add a column for the Amazon S3 file path. Then, create the DynamicFrame and apply a map transformation to add the partition columns, as shown in the following example. Nov 22, 2021 · Uncaught TypeError: Failed to resolve module specifier "axios".

recovery position child

KillerCodeMonkey changed the title Parcel removes relative path prefix of scripts in html input file since v2.0.0 Failed to resolve module specifier "react/jsx-runtime" since v2.0.0 Jan 18, 2022. ... I deactivated nodeIntegration and activated contextIsolation for my BrowserWindows created by the main process. Uncaught TypeError: Failed to resolve module specifier "axios". Most examples built for the CLI will show an import to axios at the top of the file something like this: import axios from 'axios';. AttributeError: module 'tensorflow' has no attribute 'to_int32' site:stackoverflow.com; ignoring warnings; pytest run only failed test; No module named PyInstaller; ValueError: columns overlap but no suffix specified: TypeError: 'float' object is not callable; no 'access-control-allow-origin' header is present on the requested resource. Mar 04, 2022 · Use the dependency out of process. This solution is more for module users than module authors. This is a solution to use when confronted with a module that won't work due to an existing dependency conflict. Dependency conflicts occur because two versions of the same assembly are loaded into the same .NET process..I'm getting a "Failed to connect to an IPC.

jft exam registration

Review installer.log to determine the cause of the installation failure. The collision module is dependent on an AnimWires module above it for wire guided method. Either that AnimWires module is inactive or deactivated from errors, or does not have the "affectCollision" option checked. (Collision) This message, and the following "Dependency. Website Hosting. MySite provides free hosting and affordable premium web hosting services to over 100,000 satisfied customers. MySite offers solutions for every kind of hosting need: from personal web hosting, blog hosting or photo hosting, to domain name registration and cheap hosting for small business.. "/>. Mar 04, 2022 · Use the dependency out of process. This solution is more for module users than module authors. This is a solution to use when confronted with a module that won't work due to an existing dependency conflict. Dependency conflicts occur because two versions of the same assembly are loaded into the same .NET process..I'm getting a "Failed to connect to an IPC.

roblox unblocked download for school

VueJs - Failed to resolve module specifier axios. In Programming Tags # axios #vuejs #javascript Published 11/22/2021. . Sep 15, 2021 · To solve this, the SDK version can be specified in global.json and checked into source control as a common file which would be the same for all developers and ensure that the same SDK version is being used in. Website Hosting. MySite provides free hosting and affordable premium web hosting services to over 100,000 satisfied customers. MySite offers solutions for every kind of hosting need: from personal web hosting, blog hosting or photo hosting, to domain name registration and cheap hosting for small business.. "/>. To include the partition columns in the DynamicFrame, create a DataFrame first, and then add a column for the Amazon S3 file path. Then, create the DynamicFrame and apply a map transformation to add the partition columns, as shown in the following example. Nov 22, 2021 · Uncaught TypeError: Failed to resolve module specifier "axios".


pathfinder chronicler nethys

ews 401 unauthorized office 365

Uncaught TypeError: Failed to resolve module specifier "axios". Most examples built for the CLI will show an import to axios at the top of the file something like this: import axios from 'axios';. Would be nice to add a theory of operation, or how/whey this should resolve the problem. Maybe also include the correct process for flashing an ESP32 outside of a development board, the best solution for a development board, and why some boards fail. I believe to flash an ESP32, pin IO0 needs to be LOW (0v) when the chip boots.

red light effect music

But now when I run my application, I get the following: Uncaught TypeError: Failed to resolve module specifier "react".. Remove any temporary items from the metro bundler's cache. These cases might work for you if your problem is related to external dependencies that may have changed (maybe you changed your node_modules without re-running. .

zello android auto

But now when I run my application, I get the following: Uncaught TypeError: Failed to resolve module specifier "react".. Remove any temporary items from the metro bundler's cache. These cases might work for you if your problem is related to external dependencies that may have changed (maybe you changed your node_modules without re-running. . Search for jobs related to Electron failed to resolve module specifier or hire on the world's largest freelancing marketplace with 21m+ jobs. It's free to sign up and bid on jobs. famed italian violin makers. Jul 30, 2021 · Subscribe or Follow Me For Updates. Subscribe to my YouTube channel or follow me on Twitter, Facebook or GitHub to be notified when I post new content..The App component shows a list of items (hits = Hacker News articles). The state and state update function come from the state hook called useState that is responsible to manage.

el ruiseor y la rosa resumen

Mar 04, 2022 · Use the dependency out of process. This solution is more for module users than module authors. This is a solution to use when confronted with a module that won't work due to an existing dependency conflict. Dependency conflicts occur because two versions of the same assembly are loaded into the same .NET process..I'm getting a "Failed to connect to an IPC. Select System Data Source and select Next. 5. Select SQL Server and click Next and then Finish. 6. Type the name for the ODBC connection and the name of the SQL server in the appropriate text boxes. 7. Click Next and then select the With SQL server authentication using a login id and password entered by the user checkbox. 8. Click Next and. Uncaught TypeError: Failed to resolve module specifier "axios". Most examples built for the CLI will show an import to axios at the top of the file something like this: import axios from 'axios';.


lamona oven settings symbols

torah hebrew english transliteration

The external module is an async module . module : Not implemented yet, but planned to load modules via import x from "...". script: Loads a url via <script> tag and gets the exports from a global variable (and optionally properties of it). Would be nice to add a theory of operation, or how/whey this should resolve the problem. Maybe also include the correct process for flashing an ESP32 outside of a development board, the best solution for a development board, and why some boards fail. I believe to flash an ESP32, pin IO0 needs to be LOW (0v) when the chip boots.

torchbearer rpg pdf

Failed to load module script: The server responded with a non-JavaScript MIME type of "text/html". Strict MIME type checking is enforced for module scripts per HTML spec. Here is my index.html:. As Nact is a commonjs module, you'll need a bundler like Parcel or Webpack to be able to convert the library into the appropriate module format. Share. Uncaught TypeError: Failed to resolve module specifier "axios". Most examples built for the CLI will show an import to axios at the top of the file something like this: import axios from 'axios';.

at least one other status code is required to identify the missing or invalid information

Website Hosting. MySite provides free hosting and affordable premium web hosting services to over 100,000 satisfied customers. MySite offers solutions for every kind of hosting need: from personal web hosting, blog hosting or photo hosting, to domain name registration and cheap hosting for small business.. "/>. So, in order to fix the issue, you can open an elevated command prompt (Run as Administrator) and execute the below command, after of course you replace " number " with the version of SQL Server in terms of number. mofcomp "%programfiles (x86)%\Microsoft SQL Server\number\Shared\sqlmgmproviderxpsp2up.mof". In order to find the right version. Search for jobs related to Electron failed to resolve module specifier or hire on the world's largest freelancing marketplace with 21m+ jobs. It's free to sign up and bid on jobs.

fortigate show dhcp ip address

I get electron -quick-start and electron -polymer from fluidnext to use for my Polymer 3 application. When i try to import my webcomponents to the project, i have got this error: Uncaught TypeError: Failed to resolve module specifier. VueJs - Failed to resolve module specifier axios. In Programming Tags # axios #vuejs #javascript Published 11/22/2021. . Sep 15, 2021 · To solve this, the SDK version can be specified in global.json and checked into source control as a common file which would be the same for all developers and ensure that the same SDK version is being used in.


naijanet yoruba movies download

sis sex toy mom ass stories

Search for jobs related to Electron failed to resolve module specifier or hire on the world's largest freelancing marketplace with 21m+ jobs. It's free to sign up and bid on jobs. For the EB1 category, the current estimate is 2–3 years to get a green card. This number will vary by your country of birth - all EB1 categories are currently backlogged, but China’s priority date is further behind the rest of the world. It’s safe to say.

psalm 23 good news bible

For the EB1 category, the current estimate is 2–3 years to get a green card. This number will vary by your country of birth - all EB1 categories are currently backlogged, but China’s priority date is further behind the rest of the world. It’s safe to say. The main problem comes from not being able to resolve file locations of "from" statements. All begins with the main import command, after running npm install @js-temporal/polyfill. Uncaught TypeError: Failed to resolve module specifier "big-integer". Relative references must start with either "/", "./", or "../". Website Hosting. MySite provides free hosting and affordable premium web hosting services to over 100,000 satisfied customers. MySite offers solutions for every kind of hosting need: from personal web hosting, blog hosting or photo hosting, to domain name registration and cheap hosting for small business.. "/>. Unable to use imports... Hello everyone, I've made a little library file called utils.js that is on my home, I've created a second file next to it to use the utility classes contained in the utils file but it will not... I'm getting this error: Failed to resolve module specifier "./utils.js". Invalid relative url or base scheme isn't hierarchical.

kirkham cobra 427 for sale

Search for jobs related to Electron failed to resolve module specifier or hire on the world's largest freelancing marketplace with 21m+ jobs. It's free to sign up and bid on jobs.

kubota dpf regeneration instructions

If that doesn't work, we need to perform a System File Check and then run the Deployment Image Servicing and Management tool (DISM). Right click the Windows Start button and select Command Prompt (Admin). Type 'sfc /scannow' and hit Enter. Allow the process to complete. Type 'DISM /Online /Cleanup-Image /RestoreHealth' and hit Enter.


ruger pc 9mm carbine aftermarket parts

tony from catfish last name

Nov 22, 2021 · Uncaught TypeError: Failed to resolve module specifier "axios". Most examples built for the CLI will show an import to axios at the top of the file something like this: import axios from 'axios';. hud updates. salat maghreb myrtle beach sc pes refinery capacity; ios 16 font emoji download people who dropped out of college. Search for jobs related to Electron failed to resolve module specifier or hire on the world's largest freelancing marketplace with 21m+ jobs. It's free to sign up and bid on jobs. Would be nice to add a theory of operation, or how/whey this should resolve the problem. Maybe also include the correct process for flashing an ESP32 outside of a development board, the best solution for a development board, and why some boards fail. I believe to flash an ESP32, pin IO0 needs to be LOW (0v) when the chip boots.

longest word sololearn

Select System Data Source and select Next. 5. Select SQL Server and click Next and then Finish. 6. Type the name for the ODBC connection and the name of the SQL server in the appropriate text boxes. 7. Click Next and then select the With SQL server authentication using a login id and password entered by the user checkbox. 8. Click Next and. This module can be used as an alternative to the following functions or modules in. Failed to resolve module specifier "process". Relative references must start with either "/", "./", or "../". ... The value of the HelpInfoUri key in the module manifest must resolve to a container or root URL on a website where the help files are stored.. LKML.

filmora overlay pack free download

When i try to import my webcomponents to the project, i have got this error: Uncaught TypeError: Failed to resolve module specifier "@polymer/polymer/polymer. Jun 07, 2022 · Common root issues and resolutions include: Scaling with insufficient compute (CRP) quota. To resolve, first scale your cluster back to a stable goal state within quota. Failed to resolve module specifier process You can add a data source by either selecting a gateway and click Add data source, or go to Gateway > Add data source. You can then select the Data Source Type from the list. Please select Sharepoint List (on-premises) instead of oracle. View solution in original post. The second way to fix the DLL load failed: the specified module could not be found problem is to scan the virus of your computer. Now, here is the tutorial. Step 1: Press Windows key and I key together to open Settings, then choose Update & Security to continue. Step 2: In the pop-up window, choose Windows Defender in the left pane. Would be nice to add a theory of operation, or how/whey this should resolve the problem. Maybe also include the correct process for flashing an ESP32 outside of a development board, the best solution for a development board, and why some boards fail. I believe to flash an ESP32, pin IO0 needs to be LOW (0v) when the chip boots.


commonwealth games 2022 medal tally

original bose soundlink replacement battery

AttributeError: module 'tensorflow' has no attribute 'to_int32' site:stackoverflow.com; ignoring warnings; pytest run only failed test; No module named PyInstaller; ValueError: columns overlap but no suffix specified: TypeError: 'float' object is not callable; no 'access-control-allow-origin' header is present on the requested resource. Uncaught TypeError: Failed to resolve module specifier "axios". Most examples built for the CLI will show an import to axios at the top of the file something like this: import axios from 'axios';. Failed to resolve module specifier process You can add a data source by either selecting a gateway and click Add data source, or go to Gateway > Add data source. You can then select the Data Source Type from the list. Please select Sharepoint List (on-premises) instead of oracle. View solution in original post. This module can be used as an alternative to the following functions or modules in. Failed to resolve module specifier "process". Relative references must start with either "/", "./", or "../". ... The value of the HelpInfoUri key in the module manifest must resolve to a container or root URL on a website where the help files are stored.. LKML.

do what mattereth most craven lesson

. This module can be used as an alternative to the following functions or modules in. Failed to resolve module specifier "process". Relative references must start with either "/", "./", or "../". ... The value of the HelpInfoUri key in the module manifest must resolve to a container or root URL on a website where the help files are stored.. LKML. Search for jobs related to Electron failed to resolve module specifier or hire on the world's largest freelancing marketplace with 21m+ jobs. It's free to sign up and bid on jobs.

devexpress report navigation

The specified module could not be found. Error: Failed to Load DLL: pmsapbwc.dll for Plug-in: PC_SAPBW, vendor Informatica. The specified module could not be found. Error: Failed to Load DLL: pmsapisuplg.dll for Plug-in: PC_SAPISU, Vendor: Informatica. This specified module could not be found. Im trying to use Toastify-js, a library for toast type messages, installing it using. Review installer.log to determine the cause of the installation failure. The collision module is dependent on an AnimWires module above it for wire guided method. Either that AnimWires module is inactive or deactivated from errors, or does not have the "affectCollision" option checked. (Collision) This message, and the following "Dependency. Issue the dir dfc# module #-bootflash: command in order to verify if there is a crash information file and when it was written. If the DFC reset matches the crashinfo timestamp, issue the more dfc# module #-bootflash: filename command. Or, issue the copy dfc# module #-bootflash: filename tftp command in order to transfer the file via TFTP to a.

laravel 404 not found nginx

So, in order to fix the issue, you can open an elevated command prompt (Run as Administrator) and execute the below command, after of course you replace " number " with the version of SQL Server in terms of number. mofcomp "%programfiles (x86)%\Microsoft SQL Server\number\Shared\sqlmgmproviderxpsp2up.mof". In order to find the right version. The specified module could not be found. Error: Failed to Load DLL: pmsapbwc.dll for Plug-in: PC_SAPBW, vendor Informatica. The specified module could not be found. Error: Failed to Load DLL: pmsapisuplg.dll for Plug-in: PC_SAPISU, Vendor: Informatica. This specified module could not be found. Im trying to use Toastify-js, a library for toast type messages, installing it using. Mar 04, 2022 · Use the dependency out of process. This solution is more for module users than module authors. This is a solution to use when confronted with a module that won't work due to an existing dependency conflict. Dependency conflicts occur because two versions of the same assembly are loaded into the same .NET process. VueJs - Failed to resolve module specifier axios. In Programming Tags # axios #vuejs #javascript Published 11/22/2021. . Sep 15, 2021 · To solve this, the SDK version can be specified in global.json and checked into source control as a common file which would be the same for all developers and ensure that the same SDK version is being used in. The second way to fix the DLL load failed: the specified module could not be found problem is to scan the virus of your computer. Now, here is the tutorial. Step 1: Press Windows key and I key together to open Settings, then choose Update & Security to continue. Step 2: In the pop-up window, choose Windows Defender in the left pane. And if the replies as above are helpful, we would appreciate you to mark them as answers, and if you resolve it using your own solution, please share your experience and solution here. It will be greatly helpful to others who have the same question. Appreciate for your feedback. Best Regards, Albert Ling.


243 ammo for sale

microbit motor driver

Mar 04, 2022 · Use the dependency out of process. This solution is more for module users than module authors. This is a solution to use when confronted with a module that won't work due to an existing dependency conflict. Dependency conflicts occur because two versions of the same assembly are loaded into the same .NET process..I'm getting a "Failed to connect to an IPC.

donde ver naruto shippuden en castellano

Search for jobs related to Electron failed to resolve module specifier or hire on the world's largest freelancing marketplace with 21m+ jobs. It's free to sign up and bid on jobs. (6)es-module-shims.jsについてはこちら (7)postprocessingの使い方を参考にやっていたら新たなエラーが発生. ここに書かれているファイルが足.

detector de musica pc

Select System Data Source and select Next. 5. Select SQL Server and click Next and then Finish. 6. Type the name for the ODBC connection and the name of the SQL server in the appropriate text boxes. 7. Click Next and then select the With SQL server authentication using a login id and password entered by the user checkbox. 8. Click Next and. . Then go to the Transaction "SE37" and enter the function module (ZAU_CONCUR_IDOC_UPLD) put a break point in the function module as shown in the below. Step 4: 1.Go the Transaction "BD20", enter the newly generated IDOC and execute. 2. After click on execute button, it will trigger into the function module as shown in the below. Search for jobs related to Electron failed to resolve module specifier or hire on the world's largest freelancing marketplace with 21m+ jobs. It's free to sign up and bid on jobs.

nushu a secret language reading answers mini ielts

Search for jobs related to Electron failed to resolve module specifier or hire on the world's largest freelancing marketplace with 21m+ jobs. It's free to sign up and bid on jobs. Would be nice to add a theory of operation, or how/whey this should resolve the problem. Maybe also include the correct process for flashing an ESP32 outside of a development board, the best solution for a development board, and why some boards fail. I believe to flash an ESP32, pin IO0 needs to be LOW (0v) when the chip boots.


wife porn forum

csgo wallhack download

So, in order to fix the issue, you can open an elevated command prompt (Run as Administrator) and execute the below command, after of course you replace " number " with the version of SQL Server in terms of number. mofcomp "%programfiles (x86)%\Microsoft SQL Server\number\Shared\sqlmgmproviderxpsp2up.mof". In order to find the right version. This module can be used as an alternative to the following functions or modules in. Failed to resolve module specifier "process". Relative references must start with either "/", "./", or "../". ... The value of the HelpInfoUri key in the module manifest must resolve to a container or root URL on a website where the help files are stored.. LKML. For the EB1 category, the current estimate is 2–3 years to get a green card. This number will vary by your country of birth - all EB1 categories are currently backlogged, but China’s priority date is further behind the rest of the world. It’s safe to say.

natural gas pressure gauge water column

!MESSAGE Module named 'MyAPP' failed to deploy.!SUBENTRY 1 com.bea.wlw.server.core 4 4000 2008-10-09 15:24:00.390!MESSAGE weblogic.application.ModuleException: Failed to load webapp: 'MyAPPWEB'!STACK 0 java.lang.Exception: Exception received from deployment driver. In the API Gateway console, choose your API. I get electron -quick-start and electron -polymer from fluidnext to use for my Polymer 3 application. When i try to import my webcomponents to the project, i have got this error: Uncaught TypeError: Failed to resolve module specifier. The heart of Mule's batch processing functionality lies within the. Process Chain Started from the yesterday's failed step: In few instances, process chain starts from the step which was failed in the previous iteration instead of starting from the "Start" step. ... It will resolve all these import statement for you and generate one javascript.

steam on chromebook

If that doesn't work, we need to perform a System File Check and then run the Deployment Image Servicing and Management tool (DISM). Right click the Windows Start button and select Command Prompt (Admin). Type 'sfc /scannow' and hit Enter. Allow the process to complete. Type 'DISM /Online /Cleanup-Image /RestoreHealth' and hit Enter. Mar 04, 2022 · Use the dependency out of process. This solution is more for module users than module authors. This is a solution to use when confronted with a module that won't work due to an existing dependency conflict. Dependency conflicts occur because two versions of the same assembly are loaded into the same .NET process. But now when I run my application, I get the following: Uncaught TypeError: Failed to resolve module specifier "react".. Failed to resolve module specifier socket.io-client. Relative references must start with either /, ./, or ../ ... Maybe also include the correct process for flashing an ESP32 outside of a development board, the best solution. . I get electron -quick-start and electron -polymer from fluidnext to use for my Polymer 3 application. When i try to import my webcomponents to the project, i have got this error: Uncaught TypeError: Failed to resolve module specifier.

telecinco television en directo por internet

If that doesn't work, we need to perform a System File Check and then run the Deployment Image Servicing and Management tool (DISM). Right click the Windows Start button and select Command Prompt (Admin). Type 'sfc /scannow' and hit Enter. Allow the process to complete. Type 'DISM /Online /Cleanup-Image /RestoreHealth' and hit Enter. Uncaught TypeError: Failed to resolve module specifier "axios". Most examples built for the CLI will show an import to axios at the top of the file something like this: import axios from 'axios';. KillerCodeMonkey changed the title Parcel removes relative path prefix of scripts in html input file since v2.0.0 Failed to resolve module specifier "react/jsx-runtime" since v2.0.0 Jan 18, 2022. ... I deactivated nodeIntegration and activated contextIsolation for my BrowserWindows created by the main process. AttributeError: module 'tensorflow' has no attribute 'to_int32' site:stackoverflow.com; ignoring warnings; pytest run only failed test; No module named PyInstaller; ValueError: columns overlap but no suffix specified: TypeError: 'float' object is not callable; no 'access-control-allow-origin' header is present on the requested resource.


tom bettini jackyl

battlefords funeral home obituaries

Failed to resolve module specifier process You can add a data source by either selecting a gateway and click Add data source, or go to Gateway > Add data source. You can then select the Data Source Type from the list. Please select Sharepoint List (on-premises) instead of oracle. View solution in original post. Jul 23, 2019 · By default, these are the installation locations: 32-bit PowerShell: C:\Windows\SysWOW64\WindowsPowerShell\v1.0\powershell.exe. 64-bit PowerShell: C:\Windows\System32\WindowsPowerShell\v1.0\powershell.exe. If that doesn't work, we need to perform a System File Check and then run the Deployment Image Servicing and Management tool (DISM). Right click the Windows Start button and select Command Prompt (Admin). Type 'sfc /scannow' and hit Enter. Allow the process to complete. Type 'DISM /Online /Cleanup-Image /RestoreHealth' and hit Enter. When i try to import my webcomponents to the project, i have got this error: Uncaught TypeError: Failed to resolve module specifier "@polymer/polymer/polymer. Jun 07, 2022 · Common root issues and resolutions include: Scaling with insufficient compute (CRP) quota. To resolve, first scale your cluster back to a stable goal state within quota. The specified module could not be found. Error: Failed to Load DLL: pmsapbwc.dll for Plug-in: PC_SAPBW, vendor Informatica. The specified module could not be found. Error: Failed to Load DLL: pmsapisuplg.dll for Plug-in: PC_SAPISU, Vendor: Informatica. This specified module could not be found. Im trying to use Toastify-js, a library for toast type messages, installing it using.

aps stamp show 2023

I get electron -quick-start and electron -polymer from fluidnext to use for my Polymer 3 application. When i try to import my webcomponents to the project, i have got this error: Uncaught TypeError: Failed to resolve module specifier. Would be nice to add a theory of operation, or how/whey this should resolve the problem. Maybe also include the correct process for flashing an ESP32 outside of a development board, the best solution for a development board, and why some boards fail. I believe to flash an ESP32, pin IO0 needs to be LOW (0v) when the chip boots. The specified module could not be found. Error: Failed to Load DLL: pmsapbwc.dll for Plug-in: PC_SAPBW, vendor Informatica. The specified module could not be found. Error: Failed to Load DLL: pmsapisuplg.dll for Plug-in: PC_SAPISU, Vendor: Informatica. This specified module could not be found. Im trying to use Toastify-js, a library for toast type messages, installing it using. .

free flac albums

Issue the dir dfc# module #-bootflash: command in order to verify if there is a crash information file and when it was written. If the DFC reset matches the crashinfo timestamp, issue the more dfc# module #-bootflash: filename command. Or, issue the copy dfc# module #-bootflash: filename tftp command in order to transfer the file via TFTP to a. The specified module could not be found. Error: Failed to Load DLL: pmsapbwc.dll for Plug-in: PC_SAPBW, vendor Informatica. The specified module could not be found. Error: Failed to Load DLL: pmsapisuplg.dll for Plug-in: PC_SAPISU, Vendor: Informatica. This specified module could not be found. Im trying to use Toastify-js, a library for toast type messages, installing it using.

gina wilson all things algebra 2012 2016 answer key pdf

In general, look for scripts which import by module name / specifier like this: import Vue from "vue"; instead of loading by path: import Vue from "./vue.js"; Module specifiers don't contain / and they have no extension. They work in environments like node but not in a browser. See also: module specifier in es6 import and export.


katmoviehd apk online

youku tv dramas

Jul 23, 2019 · By default, these are the installation locations: 32-bit PowerShell: C:\Windows\SysWOW64\WindowsPowerShell\v1.0\powershell.exe. 64-bit PowerShell: C:\Windows\System32\WindowsPowerShell\v1.0\powershell.exe. For the EB1 category, the current estimate is 2–3 years to get a green card. This number will vary by your country of birth - all EB1 categories are currently backlogged, but China’s priority date is further behind the rest of the world. It’s safe to say. Review installer.log to determine the cause of the installation failure. The collision module is dependent on an AnimWires module above it for wire guided method. Either that AnimWires module is inactive or deactivated from errors, or does not have the "affectCollision" option checked. (Collision) This message, and the following "Dependency.

cyberpunk 2077 edgerunners jacket

Search for jobs related to Electron failed to resolve module specifier or hire on the world's largest freelancing marketplace with 21m+ jobs. It's free to sign up and bid on jobs.

skyline r35 for sale near Bangladesh

But now when I run my application, I get the following: Uncaught TypeError: Failed to resolve module specifier "react".. Failed to resolve module specifier socket.io-client. Relative references must start with either /, ./, or ../ ... Maybe also include the correct process for flashing an ESP32 outside of a development board, the best solution. Aug 06, 2018 · Now is the time to deal with your 'The specified module could not be found' problem: Enter your Registry Editor tool. Go to HKEY_LOCAL_MACHINE > Software > Microsoft > Windows > CurrentVersion. Double-click on it. Then delete Run. Navigate to HKEY_CURRENT_USER > Software > Microsoft > Windows > CurrentVersion.. 15h ago.

integrated chinese 1 4th edition textbook pdf

Search for jobs related to Electron failed to resolve module specifier or hire on the world's largest freelancing marketplace with 21m+ jobs. It's free to sign up and bid on jobs. . .